Reaction Details
TargetP2Y purinoceptor 12
LigandBDBM50000918
Substrate/Competitorn/a
Meas. Tech.ChEBML_162869
EC50 55.0±n/a nM
Citation Meanwell, NAPearce, BCRoth, HRSmith, ECWedding, DLWright, JJBuchanan, JOBaryla, UMGamberdella, MGillespie, E Inhibitors of blood platelet cAMP phosphodiesterase. 2. Structure-activity relationships associated with 1,3-dihydro-2H-imidazo[4,5-b]quinolin-2-ones substituted with functionalized side chains. J Med Chem35:2672-87 (1992) P2Y purinoceptor 12
Name:P2Y purinoceptor 12
Type:Enzyme
Mol. Mass.:39458.48
Organism:Homo sapiens (Human)
Description:Q9H244
Residue:342
BDBM50000918
NameBDBM50000918
Synonyms:7-(4-Hydroxy-butoxy)-1,3-dihydro-imidazo[4,5-b]quinolin-2-one | CHEMBL91478
TypeSmall organic molecule
Emp. Form.C14H15N3O3
Mol. Mass.273.2872
SMILESOCCCCOc1ccc2nc3[nH]c(=O)[nH]c3cc2c1