Reaction Details
TargetP2Y purinoceptor 12
LigandBDBM50000891
Substrate/Competitorn/a
Meas. Tech.ChEMBL_162869 (CHEMBL767230)
EC50 140±n/a nM
Citation Meanwell, NAPearce, BCRoth, HRSmith, ECWedding, DLWright, JJBuchanan, JOBaryla, UMGamberdella, MGillespie, E Inhibitors of blood platelet cAMP phosphodiesterase. 2. Structure-activity relationships associated with 1,3-dihydro-2H-imidazo[4,5-b]quinolin-2-ones substituted with functionalized side chains. J Med Chem35:2672-87 (1992) P2Y purinoceptor 12
Name:P2Y purinoceptor 12
Type:Enzyme
Mol. Mass.:39458.48
Organism:Homo sapiens (Human)
Description:Q9H244
Residue:342
BDBM50000891
NameBDBM50000891
Synonyms:5-(1-Methyl-2-oxo-2,3-dihydro-1H-imidazo[4,5-b]quinolin-7-yloxy)-pentanoic acid cycloheptyl-methyl-amide | CHEMBL88764
TypeSmall organic molecule
Emp. Form.C24H32N4O3
Mol. Mass.424.5359
SMILESCN(C1CCCCCC1)C(=O)CCCCOc1ccc2nc3[nH]c(=O)n(C)c3cc2c1