Reaction Details
TargetCarbonic anhydrase 1
LigandBDBM50240175
Substrate/Competitorn/a
Meas. Tech.ChEBML_1667777
Ki 192±n/a nM
Citation Carta, FVullo, DOsman, SMAlOthman, ZSupuran, CT Synthesis and carbonic anhydrase inhibition of a series of SLC-0111 analogs. Bioorg Med Chem25:2569-2576 (2017) 
 
Carbonic anhydrase 1
Name:Carbonic anhydrase 1
Type:Enzyme
Mol. Mass.:28873.37
Organism:Homo sapiens (Human)
Description:P00915
Residue:261
BDBM50240175
NameBDBM50240175
Synonyms:CHEMBL4071714 | US9962398, Compound MST-146
TypeSmall organic molecule
Emp. Form.C14H11ClF3N3O3S
Mol. Mass.393.769
SMILESNS(=O)(=O)c1ccc(NC(=O)Nc2ccc(cc2Cl)C(F)(F)F)cc1