Reaction Details
TargetCarbonic anhydrase 9
LigandBDBM50240178
Substrate/Competitorn/a
Meas. Tech.ChEMBL_1667779 (CHEMBL4017667)
Ki 3.7±n/a nM
Citation Carta, FVullo, DOsman, SMAlOthman, ZSupuran, CT Synthesis and carbonic anhydrase inhibition of a series of SLC-0111 analogs. Bioorg Med Chem25:2569-2576 (2017) 
 
Carbonic anhydrase 9
Name:Carbonic anhydrase 9
Type:Enzyme
Mol. Mass.:49669.03
Organism:Homo sapiens (Human)
Description:Catalytic domain of human cloned isozyme was used in the assay
Residue:459
BDBM50240178
NameBDBM50240178
Synonyms:CHEMBL4090086 | US9962398, Compound MST-142
TypeSmall organic molecule
Emp. Form.C13H11F2N3O3S
Mol. Mass.327.307
SMILESNS(=O)(=O)c1ccc(NC(=O)Nc2ccc(F)cc2F)cc1