Reaction Details
TargetCarbonic anhydrase 12
LigandBDBM50240182
Substrate/Competitorn/a
Meas. Tech.ChEMBL_1667780 (CHEMBL4017668)
Ki 6.2±n/a nM
Citation Carta, FVullo, DOsman, SMAlOthman, ZSupuran, CT Synthesis and carbonic anhydrase inhibition of a series of SLC-0111 analogs. Bioorg Med Chem25:2569-2576 (2017) 
 
Carbonic anhydrase 12
Name:Carbonic anhydrase 12
Type:Enzyme
Mol. Mass.:39456.00
Organism:Homo sapiens (Human)
Description:Catalytic domain of human cloned isozyme was used in the assay
Residue:354
BDBM50240182
NameBDBM50240182
Synonyms:CHEMBL4088487 | US9962398, Compound MST-137
TypeSmall organic molecule
Emp. Form.C13H10F3N3O3S
Mol. Mass.345.297
SMILESNS(=O)(=O)c1ccc(NC(=O)Nc2cc(F)c(F)cc2F)cc1