Reaction Details
TargetFocal adhesion kinase 1
LigandBDBM50240197
Substrate/Competitorn/a
Meas. Tech.ChEMBL_1667787 (CHEMBL4017675)
IC50 2450±n/a nM
Citation Sun, JRen, SZLu, XYLi, JJShen, FQXu, CZhu, HL Discovery of a series of 1,3,4-oxadiazole-2(3H)-thione derivatives containing piperazine skeleton as potential FAK inhibitors. Bioorg Med Chem25:2593-2600 (2017) 
 
Focal adhesion kinase 1
Name:Focal adhesion kinase 1
Type:Tyrosine-protein kinase
Mol. Mass.:119233.17
Organism:Homo sapiens (Human)
Description:Q05397
Residue:1052
BDBM50240197
NameBDBM50240197
Synonyms:CHEMBL4068745
TypeSmall organic molecule
Emp. Form.C20H21N5O3S
Mol. Mass.411.477
SMILESS=c1oc(nn1CN1CCN(CC1)c1ccccn1)-c1ccc2OCCOc2c1