Reaction Details
TargetFocal adhesion kinase 1
LigandBDBM50240200
Substrate/Competitorn/a
Meas. Tech.ChEMBL_1667787 (CHEMBL4017675)
IC50 1970±n/a nM
Citation Sun, JRen, SZLu, XYLi, JJShen, FQXu, CZhu, HL Discovery of a series of 1,3,4-oxadiazole-2(3H)-thione derivatives containing piperazine skeleton as potential FAK inhibitors. Bioorg Med Chem25:2593-2600 (2017) 
 
Focal adhesion kinase 1
Name:Focal adhesion kinase 1
Type:Tyrosine-protein kinase
Mol. Mass.:119233.17
Organism:Homo sapiens (Human)
Description:Q05397
Residue:1052
BDBM50240200
NameBDBM50240200
Synonyms:CHEMBL4084931
TypeSmall organic molecule
Emp. Form.C22H24N4O3S
Mol. Mass.424.516
SMILESS=c1oc(nn1CN1CCN(Cc2ccccc2)CC1)-c1ccc2OCCOc2c1