Reaction Details
TargetMacrophage colony-stimulating factor 1 receptor
LigandBDBM50240213
Substrate/Competitorn/a
Meas. Tech.ChEMBL_1667795 (CHEMBL4017683)
IC50 0.900000±n/a nM
Citation Ramachandran, SAJadhavar, PSMiglani, SKSingh, MPKalane, DPAgarwal, AKSathe, BDMukherjee, KGupta, AHaldar, SRaja, MSingh, SPham, SMChakravarty, SQuinn, KBelmar, SAlfaro, IEHiggs, CBernales, SHerrera, FJRai, R Design, synthesis and optimization of bis-amide derivatives as CSF1R inhibitors. Bioorg Med Chem Lett27:2153-2160 (2017) 
 
Macrophage colony-stimulating factor 1 receptor
Name:Macrophage colony-stimulating factor 1 receptor
Type:Protein
Mol. Mass.:107979.48
Organism:Homo sapiens (Human)
Description:P07333
Residue:972
BDBM50240213
NameBDBM50240213
Synonyms:CHEMBL4085366
TypeSmall organic molecule
Emp. Form.C24H19F3N6O2
Mol. Mass.480.4419
SMILESCc1ncc(NC(=O)c2cccc(c2)C(F)(F)F)cc1NC(=O)c1cncc(c1)-c1cnn(C)c1