Reaction Details
TargetInsulin receptor
LigandBDBM244025
Substrate/Competitorn/a
Meas. Tech.ChEMBL_1667905 (CHEMBL4017793)
IC50 2.8±n/a nM
Citation Achary, RMathi, GRLee, DHYun, CSLee, COKim, HRPark, CHKim, PHwang, JY Novel 2,4-diaminopyrimidines bearing fused tricyclic ring moiety for anaplastic lymphoma kinase (ALK) inhibitor. Bioorg Med Chem Lett27:2185-2191 (2017) 
 
Insulin receptor
Name:Insulin receptor
Type:Receptor Tyrosine Kinase
Mol. Mass.:156322.60
Organism:Homo sapiens (Human)
Description:P06213
Residue:1382
BDBM244025
NameBDBM244025
Synonyms:9-((5-chloro-4-(2-(isopropylsulfonyl)phenyl)aminopyrimidin-2-yl)amino)-10-methoxy-2,3,6,7-tetrahydro-1H-pyrazino[2,1-a]isoquinoline)-4(11bH)-one | US10053458, 84
TypeSmall organic molecule
Emp. Form.C26H29ClN6O4S
Mol. Mass.557.064
SMILESCOc1cc2C3CNCC(=O)N3CCc2cc1Nc1ncc(Cl)c(Nc2ccccc2S(=O)(=O)C(C)C)n1