Reaction Details
TargetAlpha-2A adrenergic receptor
LigandBDBM50240277
Substrate/Competitorn/a
Meas. Tech.ChEMBL_1667955 (CHEMBL4017843)
IC50 8000±n/a nM
Citation Roecker, AJEgbertson, MJones, KLGGomez, RKraus, RLLi, YKoser, AJUrban, MOKlein, RClements, MPanigel, JDaley, CWang, JFinger, ENMajercak, JSantarelli, VGregan, ICato, MFilzen, TJovanovska, AWang, YHWang, DJoyce, LASherer, ECPeng, XWang, XSun, HColeman, PJHoughton, AKLayton, ME Discovery of selective, orally bioavailable, N-linked arylsulfonamide Na Bioorg Med Chem Lett27:2087-2093 (2017) 
 
Alpha-2A adrenergic receptor
Name:Alpha-2A adrenergic receptor
Type:Enzyme
Mol. Mass.:48979.91
Organism:Homo sapiens (Human)
Description:P08913
Residue:450
BDBM50240277
NameBDBM50240277
Synonyms:CHEMBL4061793
TypeSmall organic molecule
Emp. Form.C17H20ClFN4O2S2
Mol. Mass.430.948
SMILESFc1cc(NCC23CCCN2CCC3)c(Cl)cc1S(=O)(=O)Nc1nccs1