Reaction Details
Target5-hydroxytryptamine receptor 1A
LigandBDBM50001118
Substrate/Competitorn/a
Meas. Tech.ChEBML_1551
Ki 0.400000±n/a nM
Citation Ennis, MDBaze, MESmith, MWLawson, CFMcCall, RBLahti, RAPiercey, MF Novel indolodioxanes with antihypertensive effects: potent ligands for the 5-HT1A receptor. J Med Chem35:3058-66 (1992) 5-hydroxytryptamine receptor 1A
Name:5-hydroxytryptamine receptor 1A
Type:n/a
Mol. Mass.:46122.49
Organism:Homo sapiens (Human)
Description:n/a
Residue:422
BDBM50001118
NameBDBM50001118
Synonyms:8-(7,8-Dihydro-3H-6,9-dioxa-3-aza-cyclopenta[a]naphthalen-8-ylmethyl)-1-phenyl-1,3,8-triaza-spiro[4.5]decan-4-one | CHEMBL317433
TypeSmall organic molecule
Emp. Form.C24H26N4O3
Mol. Mass.418.4882
SMILESO=C1NCN(c2ccccc2)C11CCN(CC2COc3ccc4[nH]ccc4c3O2)CC1