Reaction Details
TargetProtein kinase C theta type
LigandBDBM50240304
Substrate/Competitorn/a
Meas. Tech.ChEMBL_1668070 (CHEMBL4017958)
IC50 14±n/a nM
Citation Katoh, TTomata, YSetoh, MSasaki, STakai, TYoshitomi, YYukawa, TNakagawa, HFukumoto, STsukamoto, TNakada, Y Practical application of 3-substituted-2,6-difluoropyridines in drug discovery: Facile synthesis of novel protein kinase C theta inhibitors. Bioorg Med Chem Lett27:2497-2501 (2017) 
 
Protein kinase C theta type
Name:Protein kinase C theta type
Type:Serine/threonine-protein kinase
Mol. Mass.:81878.04
Organism:Homo sapiens (Human)
Description:Full-length human PKC theta (Panvera Catalog No. P2996).
Residue:706
BDBM50240304
NameBDBM50240304
Synonyms:CHEMBL4099368
TypeSmall organic molecule
Emp. Form.C15H13ClN4O3
Mol. Mass.332.742
SMILESClc1ccc2OCCCCOc3ccnc4[nH]c(=O)n(-c1n2)c34