Reaction Details
TargetProtein kinase C theta type
LigandBDBM50240305
Substrate/Competitorn/a
Meas. Tech.ChEMBL_1668070 (CHEMBL4017958)
IC50 0.086000±n/a nM
Citation Katoh, TTomata, YSetoh, MSasaki, STakai, TYoshitomi, YYukawa, TNakagawa, HFukumoto, STsukamoto, TNakada, Y Practical application of 3-substituted-2,6-difluoropyridines in drug discovery: Facile synthesis of novel protein kinase C theta inhibitors. Bioorg Med Chem Lett27:2497-2501 (2017) 
 
Protein kinase C theta type
Name:Protein kinase C theta type
Type:Serine/threonine-protein kinase
Mol. Mass.:81878.04
Organism:Homo sapiens (Human)
Description:Full-length human PKC theta (Panvera Catalog No. P2996).
Residue:706
BDBM50240305
NameBDBM50240305
Synonyms:CHEMBL4082370
TypeSmall organic molecule
Emp. Form.C18H21ClN6O2
Mol. Mass.388.851
SMILESCCOc1ccnc2[nH]c(=O)n(-c3nc(ccc3Cl)N3CCCNCC3)c12