Reaction Details
TargetPhosphatidylinositol 4,5-bisphosphate 3-kinase catalytic subunit gamma isoform
LigandBDBM50240326
Substrate/Competitorn/a
Meas. Tech.ChEMBL_1668121 (CHEMBL4018009)
Ki 50±n/a nM
Citation Martínez González, SRodríguez-Arístegui, SHernández, AIVarela, CGonzález Cantalapiedra, EÁlvarez, RMRodríguez Hergueta, ABischoff, JRAlbarrán, MICebriá, ACendón, ECebrián, DAlfonso, PPastor, J Generation of tricyclic imidazo[1,2-a]pyrazines as novel PI3K inhibitors by application of a conformational restriction strategy. Bioorg Med Chem Lett27:2536-2543 (2017) 
 
Phosphatidylinositol 4,5-bisphosphate 3-kinase catalytic subunit gamma isoform
Name:Phosphatidylinositol 4,5-bisphosphate 3-kinase catalytic subunit gamma isoform
Type:Enzyme Subunit
Mol. Mass.:126470.30
Organism:Homo sapiens (Human)
Description:P48736
Residue:1102
BDBM50240326
NameBDBM50240326
Synonyms:CHEMBL4068727
TypeSmall organic molecule
Emp. Form.C18H22N8O3S
Mol. Mass.430.484
SMILESCS(=O)(=O)N1CCc2c(C1)nc1c(nc(cn21)-c1cnc(N)nc1)N1CCOCC1