Reaction Details
TargetCoagulation factor IX
LigandBDBM50240469
Substrate/Competitorn/a
Meas. Tech.ChEMBL_1668200 (CHEMBL4018088)
IC50 4.9±n/a nM
Citation Sakurada, IEndo, THikita, KHirabayashi, THosaka, YKato, YMaeda, YMatsumoto, SMizuno, TNagasue, HNishimura, TShimada, SShinozaki, MTaguchi, KTakeuchi, KYokoyama, THruza, AReichert, PZhang, TWood, HBNakao, KFurusako, S Discovery of novel aminobenzisoxazole derivatives as orally available factor IXa inhibitors. Bioorg Med Chem Lett27:2622-2628 (2017) 
 
Coagulation factor IX
Name:Coagulation factor IX
Type:Enzyme
Mol. Mass.:51768.83
Organism:Homo sapiens (Human)
Description:P00740
Residue:461
BDBM50240469
NameBDBM50240469
Synonyms:CHEMBL4096341
TypeSmall organic molecule
Emp. Form.C22H19Cl2N7O2
Mol. Mass.484.338
SMILES[H][C@@]12CC[C@]([H])([C@H]1NC(=O)c1ccc(cc1Cl)-n1cnc(C)n1)N(C2)c1ncc(Cl)c2cnoc12