Reaction Details
TargetCoagulation factor IX
LigandBDBM50240482
Substrate/Competitorn/a
Meas. Tech.ChEMBL_1668200 (CHEMBL4018088)
IC50 50±n/a nM
Citation Sakurada, IEndo, THikita, KHirabayashi, THosaka, YKato, YMaeda, YMatsumoto, SMizuno, TNagasue, HNishimura, TShimada, SShinozaki, MTaguchi, KTakeuchi, KYokoyama, THruza, AReichert, PZhang, TWood, HBNakao, KFurusako, S Discovery of novel aminobenzisoxazole derivatives as orally available factor IXa inhibitors. Bioorg Med Chem Lett27:2622-2628 (2017) 
 
Coagulation factor IX
Name:Coagulation factor IX
Type:Enzyme
Mol. Mass.:51768.83
Organism:Homo sapiens (Human)
Description:P00740
Residue:461
BDBM50240482
NameBDBM50240482
Synonyms:CHEMBL4069648
TypeSmall organic molecule
Emp. Form.C21H20ClN7O2
Mol. Mass.437.882
SMILESCc1cc(N2CCC(C2)NC(=O)c2ccc(cc2Cl)-n2cnnc2)c2onc(N)c2c1