Reaction Details
TargetCoagulation factor IX
LigandBDBM50240487
Substrate/Competitorn/a
Meas. Tech.ChEMBL_1668200 (CHEMBL4018088)
IC50 13±n/a nM
Citation Sakurada, IEndo, THikita, KHirabayashi, THosaka, YKato, YMaeda, YMatsumoto, SMizuno, TNagasue, HNishimura, TShimada, SShinozaki, MTaguchi, KTakeuchi, KYokoyama, THruza, AReichert, PZhang, TWood, HBNakao, KFurusako, S Discovery of novel aminobenzisoxazole derivatives as orally available factor IXa inhibitors. Bioorg Med Chem Lett27:2622-2628 (2017) 
 
Coagulation factor IX
Name:Coagulation factor IX
Type:Enzyme
Mol. Mass.:51768.83
Organism:Homo sapiens (Human)
Description:P00740
Residue:461
BDBM50240487
NameBDBM50240487
Synonyms:CHEMBL4066380 | US9969724, Example 32
TypeSmall organic molecule
Emp. Form.C23H18Cl2N8O2
Mol. Mass.509.347
SMILESNc1noc2c(ncc(Cl)c12)N1CC[C@H](C1)NC(=O)c1ccc(cc1Cl)-n1cnc2ncccc12