Reaction Details
TargetMuscarinic acetylcholine receptor M4
LigandBDBM50240552
Substrate/Competitorn/a
Meas. Tech.ChEMBL_1668383 (CHEMBL4018271)
Ki 1.6±n/a nM
Citation Bender, AMWeiner, RLLuscombe, VBCho, HPNiswender, CMEngers, DWBridges, TMConn, PJLindsley, CW Synthesis and evaluation of 4,6-disubstituted pyrimidines as CNS penetrant pan-muscarinic antagonists with a novel chemotype. Bioorg Med Chem Lett27:2479-2483 (2017) 
 
Muscarinic acetylcholine receptor M4
Name:Muscarinic acetylcholine receptor M4
Type:Enzyme Catalytic Domain
Mol. Mass.:53079.31
Organism:Homo sapiens (Human)
Description:Cholinergic, muscarinic M4 CHRM4 HUMAN M3::P08173
Residue:479
BDBM50240552
NameBDBM50240552
Synonyms:CHEMBL195
TypeSmall organic molecule
Emp. Form.C17H23NO3
Mol. Mass.289.3694
SMILES[H][C@@]12CC[C@]([H])(CC(C1)OC(=O)C(CO)c1ccccc1)N2C