Reaction Details
TargetMuscarinic acetylcholine receptor M4
LigandBDBM50240547
Substrate/Competitorn/a
Meas. Tech.ChEMBL_1668370 (CHEMBL4018258)
IC50 140±n/a nM
Citation Bender, AMWeiner, RLLuscombe, VBCho, HPNiswender, CMEngers, DWBridges, TMConn, PJLindsley, CW Synthesis and evaluation of 4,6-disubstituted pyrimidines as CNS penetrant pan-muscarinic antagonists with a novel chemotype. Bioorg Med Chem Lett27:2479-2483 (2017) 
 
Muscarinic acetylcholine receptor M4
Name:Muscarinic acetylcholine receptor M4
Type:Enzyme Catalytic Domain
Mol. Mass.:53079.31
Organism:Homo sapiens (Human)
Description:Cholinergic, muscarinic M4 CHRM4 HUMAN M3::P08173
Residue:479
BDBM50240547
NameBDBM50240547
Synonyms:CHEMBL4083681
TypeSmall organic molecule
Emp. Form.C25H25ClN4O2
Mol. Mass.448.945
SMILESClc1ccc(Oc2cc(ncn2)N2CCC(CC2)C(=O)N2CCc3ccccc3C2)cc1