Reaction Details
TargetTyrosine-protein kinase Tec
LigandBDBM50233461
Substrate/Competitorn/a
Meas. Tech.ChEMBL_1668451 (CHEMBL4018339)
IC50>10000±n/a nM
Citation Wang, YChen, ZDai, MSun, PWang, CGao, YZhao, HZeng, WShen, LMao, WWang, THu, GLi, JChen, SLong, CChen, XLiu, JZhang, Y Discovery and optimization of selective FGFR4 inhibitors via scaffold hopping. Bioorg Med Chem Lett27:2420-2423 (2017) 
 
Tyrosine-protein kinase Tec
Name:Tyrosine-protein kinase Tec
Type:Protein
Mol. Mass.:73597.00
Organism:Homo sapiens (Human)
Description:n/a
Residue:631
BDBM50233461
NameBDBM50233461
Synonyms:CHEMBL4068896
TypeSmall organic molecule
Emp. Form.C26H22Cl2N4O3
Mol. Mass.509.384
SMILESCOc1cc(OC)c(Cl)c(c1Cl)-c1ccc2nc(Nc3c(C)cccc3NC(=O)C=C)ncc2c1