Reaction Details
TargetAdenosine receptor A1
LigandBDBM82020
Substrate/Competitorn/a
Meas. Tech.ChEBML_29284
Ki 11500±n/a nM
Citation Sakai, RKonno, KYamamoto, YSanae, FTakagi, KHasegawa, TIwasaki, NKakiuchi, MKato, HMiyamoto, K Effects of alkyl substitutions of xanthine skeleton on bronchodilation. J Med Chem35:4039-44 (1992) Adenosine receptor A1
Name:Adenosine receptor A1
Type:Enzyme Catalytic Domain
Mol. Mass.:36501.39
Organism:GUINEA PIG
Description:ADENOSINE A1 ADORA1 GUINEA PIG::P47745
Residue:326
BDBM82020
NameBDBM82020
Synonyms:1-Methyl-3,9-dihydro-purine-2,6-dione(1-methyl xanthine) CAS_80220 NSC_80220
TypeSmall organic molecule
Emp. Form.C6H6N4O2
Mol. Mass.166.1374
SMILESCn1c(=O)[nH]c2nc[nH]c2c1=O