Reaction Details
TargetAdenosine receptor A2a
LigandBDBM50001511
Substrate/Competitorn/a
Meas. Tech.ChEBML_27629
Ki 4800±n/a nM
Citation Sakai, RKonno, KYamamoto, YSanae, FTakagi, KHasegawa, TIwasaki, NKakiuchi, MKato, HMiyamoto, K Effects of alkyl substitutions of xanthine skeleton on bronchodilation. J Med Chem35:4039-44 (1992) Adenosine receptor A2a
Name:Adenosine receptor A2a
Type:Enzyme Catalytic Domain
Mol. Mass.:44955.08
Organism:GUINEA PIG
Description:ADENOSINE A2 0 GUINEA PIG::P46616
Residue:409
BDBM50001511
NameBDBM50001511
Synonyms:3-Butyl-1-methyl-3,7-dihydro-purine-2,6-dione | CHEMBL130969
TypeSmall organic molecule
Emp. Form.C10H14N4O2
Mol. Mass.222.2438
SMILESCCCCn1c2nc[nH]c2c(=O)n(C)c1=O