Reaction Details
TargetELAV-like protein 1
LigandBDBM51309
Substrate/Competitorn/a
Meas. Tech.ChEMBL_1668504 (CHEMBL4018392)
Ki 6500±n/a nM
Citation Nasti, RRossi, DAmadio, MPascale, AUnver, MYHirsch, AKHCollina, S Compounds Interfering with Embryonic Lethal Abnormal Vision (ELAV) Protein-RNA Complexes: An Avenue for Discovering New Drugs. J Med Chem60:8257-8267 (2017) 
 
ELAV-like protein 1
Name:ELAV-like protein 1
Type:PROTEIN
Mol. Mass.:36102.56
Organism:Homo sapiens (Human)
Description:ChEMBL_654855
Residue:326
BDBM51309
NameBDBM51309
Synonyms:5,7-dimethoxy-8-[1-(4-methoxyphenyl)-3-(4-morpholinyl)-3-oxopropyl]-4-phenyl-1-benzopyran-2-one 5,7-dimethoxy-8-[1-(4-methoxyphenyl)-3-morpholin-4-yl-3-oxopropyl]-4-phenylchromen-2-one MLS000879474 cid_16746461
TypeSmall organic molecule
Emp. Form.C31H31NO7
Mol. Mass.529.5803
SMILESCOc1ccc(cc1)C(CC(=O)N1CCOCC1)c1c(OC)cc(OC)c2c(cc(=O)oc12)-c1ccccc1