Reaction Details
TargetLeukotriene B4 receptor 1
LigandBDBM50001611
Substrate/Competitorn/a
Meas. Tech.ChEMBL_99487 (CHEMBL704375)
IC50 2±n/a nM
Citation Labaudinière, RDereu, NCavy, FGuillet, MCMarquis, OTerlain, B omega-[(4,6-Diphenyl-2-pyridyl)oxy]alkanoic acid derivatives: a new family of potent and orally active LTB4 antagonists. J Med Chem35:4315-24 (1992) Leukotriene B4 receptor 1
Name:Leukotriene B4 receptor 1
Type:Enzyme Catalytic Domain
Mol. Mass.:37582.68
Organism:Homo sapiens (Human)
Description:Q15722
Residue:352
BDBM50001611
NameBDBM50001611
Synonyms:(E)-3-{3-(2-Carboxy-ethyl)-4-[6-(4-methoxy-phenyl)-hex-5-enyloxy]-benzoyl}-benzoic acid 3-{3-(2-Carboxy-ethyl)-4-[(E)-6-(4-methoxy-phenyl)-hex-5-enyloxy]-benzoyl}-benzoic acid 3-{3-(2-Carboxy-ethyl)-4-[6-(4-methoxy-phenyl)-hex-5-enyloxy]-benzoyl}-benzoic acid (BT223982) CHEMBL49302 | LY-223982
TypeSmall organic molecule
Emp. Form.C30H30O7
Mol. Mass.502.555
SMILESCOc1ccc(\C=C\CCCCOc2ccc(cc2CCC(O)=O)C(=O)c2cccc(c2)C(O)=O)cc1