Reaction Details
TargetLeukotriene B4 receptor 1
LigandBDBM50001667
Substrate/Competitorn/a
Meas. Tech.ChEMBL_99487 (CHEMBL704375)
IC50 2±n/a nM
Citation Labaudinière, RDereu, NCavy, FGuillet, MCMarquis, OTerlain, B omega-[(4,6-Diphenyl-2-pyridyl)oxy]alkanoic acid derivatives: a new family of potent and orally active LTB4 antagonists. J Med Chem35:4315-24 (1992) Leukotriene B4 receptor 1
Name:Leukotriene B4 receptor 1
Type:Enzyme Catalytic Domain
Mol. Mass.:37582.68
Organism:Homo sapiens (Human)
Description:Q15722
Residue:352
BDBM50001667
NameBDBM50001667
Synonyms:6-[4-(4-Amino-phenyl)-6-phenyl-pyridin-2-yloxy]-hexanoic acid | CHEMBL136991
TypeSmall organic molecule
Emp. Form.C23H24N2O3
Mol. Mass.376.4483
SMILESNc1ccc(cc1)-c1cc(OCCCCCC(O)=O)nc(c1)-c1ccccc1