Reaction Details
TargetLeukotriene B4 receptor 1
LigandBDBM50001647
Substrate/Competitorn/a
Meas. Tech.ChEMBL_99487 (CHEMBL704375)
IC50 4.2±n/a nM
Citation Labaudinière, RDereu, NCavy, FGuillet, MCMarquis, OTerlain, B omega-[(4,6-Diphenyl-2-pyridyl)oxy]alkanoic acid derivatives: a new family of potent and orally active LTB4 antagonists. J Med Chem35:4315-24 (1992) Leukotriene B4 receptor 1
Name:Leukotriene B4 receptor 1
Type:Enzyme Catalytic Domain
Mol. Mass.:37582.68
Organism:Homo sapiens (Human)
Description:Q15722
Residue:352
BDBM50001647
NameBDBM50001647
Synonyms:6-(4-Benzo[1,3]dioxol-5-yl-6-phenyl-pyridin-2-yloxy)-2-methyl-hexanoic acid | CHEMBL137341
TypeSmall organic molecule
Emp. Form.C25H25NO5
Mol. Mass.419.4697
SMILESCC(CCCCOc1cc(cc(n1)-c1ccccc1)-c1ccc2OCOc2c1)C(O)=O