Reaction Details
TargetLeukotriene B4 receptor 1
LigandBDBM50001658
Substrate/Competitorn/a
Meas. Tech.ChEMBL_99487 (CHEMBL704375)
IC50 3±n/a nM
Citation Labaudinière, RDereu, NCavy, FGuillet, MCMarquis, OTerlain, B omega-[(4,6-Diphenyl-2-pyridyl)oxy]alkanoic acid derivatives: a new family of potent and orally active LTB4 antagonists. J Med Chem35:4315-24 (1992) Leukotriene B4 receptor 1
Name:Leukotriene B4 receptor 1
Type:Enzyme Catalytic Domain
Mol. Mass.:37582.68
Organism:Homo sapiens (Human)
Description:Q15722
Residue:352
BDBM50001658
NameBDBM50001658
Synonyms:6-(4,6-Diphenyl-pyridin-2-yloxy)-hexanoic acid | CHEMBL137504
TypeSmall organic molecule
Emp. Form.C23H23NO3
Mol. Mass.361.4336
SMILESOC(=O)CCCCCOc1cc(cc(n1)-c1ccccc1)-c1ccccc1