Reaction Details
TargetLeukotriene B4 receptor 1
LigandBDBM50001661
Substrate/Competitorn/a
Meas. Tech.ChEMBL_99487 (CHEMBL704375)
IC50 4±n/a nM
Citation Labaudinière, RDereu, NCavy, FGuillet, MCMarquis, OTerlain, B omega-[(4,6-Diphenyl-2-pyridyl)oxy]alkanoic acid derivatives: a new family of potent and orally active LTB4 antagonists. J Med Chem35:4315-24 (1992) Leukotriene B4 receptor 1
Name:Leukotriene B4 receptor 1
Type:Enzyme Catalytic Domain
Mol. Mass.:37582.68
Organism:Homo sapiens (Human)
Description:Q15722
Residue:352
BDBM50001661
NameBDBM50001661
Synonyms:6-[4-(4-Methoxy-phenyl)-6-phenyl-pyridin-2-yloxy]-2-methyl-hexanoic acid | CHEMBL137531
TypeSmall organic molecule
Emp. Form.C25H27NO4
Mol. Mass.405.4862
SMILESCOc1ccc(cc1)-c1cc(OCCCCC(C)C(O)=O)nc(c1)-c1ccccc1