Reaction Details
TargetTyrosine-protein kinase Mer
LigandBDBM50240779
Substrate/Competitorn/a
Meas. Tech.ChEMBL_1668754 (CHEMBL4018642)
IC50 4.4±n/a nM
Citation Zhu, WChen, HWang, YWang, JPeng, XChen, XGao, YLi, CHe, YAi, JGeng, MZheng, MLiu, H Design, Synthesis, and Pharmacological Evaluation of Novel Multisubstituted Pyridin-3-amine Derivatives as Multitargeted Protein Kinase Inhibitors for the Treatment of Non-Small Cell Lung Cancer. J Med Chem60:6018-6035 (2017) 
 
Tyrosine-protein kinase Mer
Name:Tyrosine-protein kinase Mer
Type:PROTEIN
Mol. Mass.:110234.77
Organism:Homo sapiens (Human)
Description:ChEMBL_1498723
Residue:999
BDBM50240779
NameBDBM50240779
Synonyms:CHEMBL4067871
TypeSmall organic molecule
Emp. Form.C28H22ClN3O2
Mol. Mass.467.946
SMILESOC[C@H](Nc1cnc(-c2cc(Cl)ccc2O)c(c1)-c1ccc2cnccc2c1)c1ccccc1