Reaction Details
TargetWee1-like protein kinase 2
LigandBDBM4552
Substrate/Competitorn/a
Meas. Tech.ChEMBL_1668980 (CHEMBL4018868)
Kd 106±n/a nM
Citation Zhu, JYCuellar, RABerndt, NLee, HEOlesen, SHMartin, MPJensen, JTGeorg, GISchönbrunn, E Structural Basis of Wee Kinases Functionality and Inactivation by Diverse Small Molecule Inhibitors. J Med Chem60:7863-7875 (2017) 
 
Wee1-like protein kinase 2
Name:Wee1-like protein kinase 2
Type:PROTEIN
Mol. Mass.:62923.50
Organism:Homo sapiens (Human)
Description:ChEMBL_774226
Residue:567
BDBM4552
NameBDBM4552
Synonyms:4-[(2,4-Dichloro-5-methoxyphenyl)amino]-6-methoxy-7-[3-(4-methyl-1-piperazinyl)propoxy]-3-quinolinecarbonitrile BOSUTINIB SKI-606
TypeSmall organic molecule
Emp. Form.C26H29Cl2N5O3
Mol. Mass.530.446
SMILESCOc1cc(Nc2c(cnc3cc(OCCCN4CCN(C)CC4)c(OC)cc23)C#N)c(Cl)cc1Cl