Reaction Details
TargetMembrane-associated tyrosine- and threonine-specific cdc2-inhibitory kinase
LigandBDBM4552
Substrate/Competitorn/a
Meas. Tech.ChEMBL_1668981 (CHEMBL4018869)
Kd 270±n/a nM
Citation Zhu, JYCuellar, RABerndt, NLee, HEOlesen, SHMartin, MPJensen, JTGeorg, GISchönbrunn, E Structural Basis of Wee Kinases Functionality and Inactivation by Diverse Small Molecule Inhibitors. J Med Chem60:7863-7875 (2017) 
 
Membrane-associated tyrosine- and threonine-specific cdc2-inhibitory kinase
Name:Membrane-associated tyrosine- and threonine-specific cdc2-inhibitory kinase
Type:PROTEIN
Mol. Mass.:54523.76
Organism:Homo sapiens (Human)
Description:ChEMBL_587209
Residue:499
BDBM4552
NameBDBM4552
Synonyms:4-[(2,4-Dichloro-5-methoxyphenyl)amino]-6-methoxy-7-[3-(4-methyl-1-piperazinyl)propoxy]-3-quinolinecarbonitrile BOSUTINIB SKI-606
TypeSmall organic molecule
Emp. Form.C26H29Cl2N5O3
Mol. Mass.530.446
SMILESCOc1cc(Nc2c(cnc3cc(OCCCN4CCN(C)CC4)c(OC)cc23)C#N)c(Cl)cc1Cl