Reaction Details
TargetAdenosine receptor A2a
LigandBDBM50304637
Substrate/Competitorn/a
Meas. Tech.ChEBML_1669045
Ki 15±n/a nM
Citation Yu, JAhn, SKim, HJLee, MAhn, SKim, JJin, SHLee, EKim, GCheong, JHJacobson, KAJeong, LSNoh, M Polypharmacology of N J Med Chem60:7459-7475 (2017) 
 
Adenosine receptor A2a
Name:Adenosine receptor A2a
Type:G Protein-Coupled Receptor (GPCR)
Mol. Mass.:44716.46
Organism:Homo sapiens (Human)
Description:P29274
Residue:412
BDBM50304637
NameBDBM50304637
Synonyms:9-(5'-Cyclopropylaminocarbonyl-4'-thio-beta-D-ribofuranosyl)-N6-(3-iodo-benzyl)adenine | CHEMBL596014
TypeSmall organic molecule
Emp. Form.C20H21IN6O3S
Mol. Mass.552.389
SMILESO[C@H]1[C@@H](O)[C@@H](S[C@@H]1C(=O)NC1CC1)n1cnc2c(NCc3cccc(I)c3)ncnc12