Reaction Details
TargetPeroxisome proliferator-activated receptor delta
LigandBDBM50214980
Substrate/Competitorn/a
Meas. Tech.ChEBML_1669058
Ki 0.620000±n/a nM
Citation Yu, JAhn, SKim, HJLee, MAhn, SKim, JJin, SHLee, EKim, GCheong, JHJacobson, KAJeong, LSNoh, M Polypharmacology of N J Med Chem60:7459-7475 (2017) 
 
Peroxisome proliferator-activated receptor delta
Name:Peroxisome proliferator-activated receptor delta
Type:Enzyme
Mol. Mass.:49910.45
Organism:Homo sapiens (Human)
Description:Q03181
Residue:441
BDBM50214980
NameBDBM50214980
Synonyms:(2R,3R,4S)-2-(2-chloro-6-(2-chlorobenzylamino)-9H-purin-9-yl)tetrahydrothiophene-3,4-diol | CHEMBL227279
TypeSmall organic molecule
Emp. Form.C16H15Cl2N5O2S
Mol. Mass.412.294
SMILESO[C@@H]1CS[C@H]([C@@H]1O)n1cnc2c(NCc3ccccc3Cl)nc(Cl)nc12