Reaction Details
TargetPeroxisome proliferator-activated receptor delta
LigandBDBM50252829
Substrate/Competitorn/a
Meas. Tech.ChEBML_1669058
Ki 2.5±n/a nM
Citation Yu, JAhn, SKim, HJLee, MAhn, SKim, JJin, SHLee, EKim, GCheong, JHJacobson, KAJeong, LSNoh, M Polypharmacology of N J Med Chem60:7459-7475 (2017) 
 
Peroxisome proliferator-activated receptor delta
Name:Peroxisome proliferator-activated receptor delta
Type:Enzyme
Mol. Mass.:49910.45
Organism:Homo sapiens (Human)
Description:Q03181
Residue:441
BDBM50252829
NameBDBM50252829
Synonyms:(2S,3S,4R,5R)-5-(6-(3-iodobenzylamino)-9H-purin-9-yl)-3,4-dihydroxy-N-methyl-tetrahydrothiophene-2-carboxamide N6-(3-Iodo-benzyl)-9-(5'-methylaminocarbonyl-4'-thiobeta-D-ribofuranosyl)adenine
TypeSmall organic molecule
Emp. Form.C18H19IN6O3S
Mol. Mass.526.351
SMILESCNC(=O)[C@H]1S[C@H]([C@H](O)[C@@H]1O)n1cnc2c(NCc3cccc(I)c3)ncnc12