Reaction Details
TargetPeroxisome proliferator-activated receptor gamma
LigandBDBM50304633
Substrate/Competitorn/a
Meas. Tech.ChEBML_1669056
Ki 0.170000±n/a nM
Citation Yu, JAhn, SKim, HJLee, MAhn, SKim, JJin, SHLee, EKim, GCheong, JHJacobson, KAJeong, LSNoh, M Polypharmacology of N J Med Chem60:7459-7475 (2017) 
 
Peroxisome proliferator-activated receptor gamma
Name:Peroxisome proliferator-activated receptor gamma
Type:Nuclear Receptor
Mol. Mass.:57613.46
Organism:Homo sapiens (Human)
Description:P37231
Residue:505
BDBM50304633
NameBDBM50304633
Synonyms:9-(5'-Cyclobutylaminocarbonyl-4'-thio-beta-D-ribofuranosyl)-N6-(3-iodobenzyl)adenine | CHEMBL594625
TypeSmall organic molecule
Emp. Form.C21H23IN6O3S
Mol. Mass.566.415
SMILESO[C@H]1[C@@H](O)[C@@H](S[C@@H]1C(=O)NC1CCC1)n1cnc2c(NCc3cccc(I)c3)ncnc12