Reaction Details
TargetAdenosine receptor A3
LigandBDBM50240867
Substrate/Competitorn/a
Meas. Tech.ChEMBL_1669078 (CHEMBL4018966)
Ki 2.7±n/a nM
Citation Xia, LBurger, WACvan Veldhoven, JPDKuiper, BJvan Duijl, TTLenselink, EBPaasman, EHeitman, LHIJzerman, AP Structure-Affinity Relationships and Structure-Kinetics Relationships of Pyrido[2,1-f]purine-2,4-dione Derivatives as Human Adenosine A J Med Chem60:7555-7568 (2017) 
 
Adenosine receptor A3
Name:Adenosine receptor A3
Type:G Protein-Coupled Receptor (GPCR)
Mol. Mass.:36197.32
Organism:Homo sapiens (Human)
Description:P0DMS8
Residue:318
BDBM50240867
NameBDBM50240867
Synonyms:CHEMBL4085275
TypeSmall organic molecule
Emp. Form.C21H24N4O3Si
Mol. Mass.408.5258
SMILESCOc1ccn2c(c1)nc1n(Cc3ccccc3)c(=O)n(C[Si](C)(C)C)c(=O)c21