Reaction Details
TargetDelta-type opioid receptor
LigandBDBM50009185
Substrate/Competitorn/a
Meas. Tech.ChEBML_146597
Ki 0.120000±n/a nM
Citation Salvadori, SBianchi, CLazarus, LHScaranari, VAttila, MTomatis, R Para-substituted Phe3 deltorphin analogues: enhanced selectivity of halogenated derivatives for delta opioid receptor sites. J Med Chem35:4651-7 (1993) Delta-type opioid receptor
Name:Delta-type opioid receptor
Type:G Protein-Coupled Receptor (GPCR)
Mol. Mass.:40465.04
Organism:Rattus norvegicus (rat)
Description:Competition binding assays were using CHO-K1 cell membranes expressing the opioid receptor.
Residue:372
BDBM50009185
NameBDBM50009185
Synonyms:4-(2-{2-[2-Amino-3-(4-hydroxy-phenyl)-propionylamino]-propionylamino}-3-phenyl-propionylamino)-4-{1-[1-(carboxymethyl-carbamoyl)-2-methyl-propylcarbamoyl]-2-methyl-propylcarbamoyl}-butyric acid Tyr-DAla-Phe-Glu-Val-Val-Gly-NH2
TypeSmall organic molecule
Emp. Form.C38H53N7O11
Mol. Mass.783.8677
SMILESCC(C)[C@H](NC(=O)[C@@H](NC(=O)[C@H](CCC(O)=O)NC(=O)[C@H](Cc1ccccc1)NC(=O)[C@H](C)NC(=O)[C@@H](N)Cc1ccc(O)cc1)C(C)C)C(=O)NCC(O)=O