Reaction Details
TargetMetabotropic glutamate receptor 5
LigandBDBM50240878
Substrate/Competitorn/a
Meas. Tech.ChEMBL_1669257 (CHEMBL4019145)
Ki 31±n/a nM
Citation Stepan, AFClaffey, MMReese, MRBalan, GBarreiro, GBarricklow, JBohanon, MJBoscoe, BPCappon, GDChenard, LKCianfrogna, JChen, LCoffman, KJDrozda, SEDunetz, JRGhosh, SHou, XHoule, CKarki, KLazzaro, JTMancuso, JYMarcek, JMMiller, ELMoen, MAO'Neil, SSakurada, ISkaddan, MParikh, VSmith, DLTrapa, PTuttle, JBVerhoest, PRWalker, DPWon, AWright, ASWhritenour, JZasadny, KZaleska, MMZhang, LShaffer, CL Discovery and Characterization of (R)-6-Neopentyl-2-(pyridin-2-ylmethoxy)-6,7-dihydropyrimido[2,1-c][1,4]oxazin-4(9H)-one (PF-06462894), an Alkyne-Lacking Metabotropic Glutamate Receptor 5 Negative Allosteric Modulator Profiled in both Rat and Nonhuman Primates. J Med Chem60:7764-7780 (2017) 
 
Metabotropic glutamate receptor 5
Name:Metabotropic glutamate receptor 5
Type:Enzyme
Mol. Mass.:132484.72
Organism:Homo sapiens (Human)
Description:n/a
Residue:1212
BDBM50240878
NameBDBM50240878
Synonyms:CHEMBL4096663
TypeSmall organic molecule
Emp. Form.C20H16N4O3
Mol. Mass.360.366
SMILESCc1cccc(COc2cc(=O)n3cc(Oc4cccnc4)ccc3n2)n1