Reaction Details
TargetMetabotropic glutamate receptor 5
LigandBDBM50240887
Substrate/Competitorn/a
Meas. Tech.ChEMBL_1669256 (CHEMBL4019144)
IC50 18±n/a nM
Citation Stepan, AFClaffey, MMReese, MRBalan, GBarreiro, GBarricklow, JBohanon, MJBoscoe, BPCappon, GDChenard, LKCianfrogna, JChen, LCoffman, KJDrozda, SEDunetz, JRGhosh, SHou, XHoule, CKarki, KLazzaro, JTMancuso, JYMarcek, JMMiller, ELMoen, MAO'Neil, SSakurada, ISkaddan, MParikh, VSmith, DLTrapa, PTuttle, JBVerhoest, PRWalker, DPWon, AWright, ASWhritenour, JZasadny, KZaleska, MMZhang, LShaffer, CL Discovery and Characterization of (R)-6-Neopentyl-2-(pyridin-2-ylmethoxy)-6,7-dihydropyrimido[2,1-c][1,4]oxazin-4(9H)-one (PF-06462894), an Alkyne-Lacking Metabotropic Glutamate Receptor 5 Negative Allosteric Modulator Profiled in both Rat and Nonhuman Primates. J Med Chem60:7764-7780 (2017) 
 
Metabotropic glutamate receptor 5
Name:Metabotropic glutamate receptor 5
Type:Enzyme
Mol. Mass.:131900.14
Organism:Rattus norvegicus (Rat)
Description:P31424
Residue:1203
BDBM50240887
NameBDBM50240887
Synonyms:CHEMBL4066731
TypeSmall organic molecule
Emp. Form.C21H19ClN2O3
Mol. Mass.382.84
SMILESClc1cccc(COc2cc(=O)n3[C@H](Cc4ccccc4)COCc3n2)c1