Reaction Details
TargetAlpha-1A adrenergic receptor
LigandBDBM50001815
Substrate/Competitorn/a
Meas. Tech.ChEBML_33271
IC50 190±n/a nM
Citation Andersen, KPerregaard, JArnt, JNielsen, JBBegtrup, M Selective, centrally acting serotonin 5-HT2 antagonists. 2. Substituted 3-(4-fluorophenyl)-1H-indoles. J Med Chem35:4823-31 (1993) Alpha-1A adrenergic receptor
Name:Alpha-1A adrenergic receptor
Type:Protein
Mol. Mass.:51620.15
Organism:Rattus norvegicus (Rat)
Description:P43140
Residue:466
BDBM50001815
NameBDBM50001815
Synonyms:1-(2-{4-[3-(4-Fluoro-phenyl)-5-trifluoromethyl-indol-1-yl]-piperidin-1-yl}-ethyl)-imidazolidin-2-one | CHEMBL355917
TypeSmall organic molecule
Emp. Form.C25H26F4N4O
Mol. Mass.474.4938
SMILESFc1ccc(cc1)-c1cn(C2CCN(CCN3CCNC3=O)CC2)c2ccc(cc12)C(F)(F)F