Reaction Details
TargetAlpha-1A adrenergic receptor
LigandBDBM50001804
Substrate/Competitorn/a
Meas. Tech.ChEBML_33271
IC50 34±n/a nM
Citation Andersen, KPerregaard, JArnt, JNielsen, JBBegtrup, M Selective, centrally acting serotonin 5-HT2 antagonists. 2. Substituted 3-(4-fluorophenyl)-1H-indoles. J Med Chem35:4823-31 (1993) Alpha-1A adrenergic receptor
Name:Alpha-1A adrenergic receptor
Type:Protein
Mol. Mass.:51620.15
Organism:Rattus norvegicus (Rat)
Description:P43140
Residue:466
BDBM50001804
NameBDBM50001804
Synonyms:1-(2-{4-[3-(4-Fluoro-phenyl)-4-methyl-indol-1-yl]-piperidin-1-yl}-ethyl)-imidazolidin-2-one | CHEMBL342730
TypeSmall organic molecule
Emp. Form.C25H29FN4O
Mol. Mass.420.5224
SMILESCc1cccc2n(cc(-c3ccc(F)cc3)c12)C1CCN(CCN2CCNC2=O)CC1