Reaction Details
TargetKappa-type opioid receptor
LigandBDBM50240967
Substrate/Competitorn/a
Meas. Tech.ChEMBL_1669356 (CHEMBL4019244)
Ki 0.072000±n/a nM
Citation Erli, FGuerrieri, EBen Haddou, TLantero, AMairegger, MSchmidhammer, HSpetea, M Highly Potent and Selective New Diphenethylamines Interacting with the?-Opioid Receptor: Synthesis, Pharmacology, and Structure-Activity Relationships. J Med Chem60:7579-7590 (2017) 
 
Kappa-type opioid receptor
Name:Kappa-type opioid receptor
Type:G Protein-Coupled Receptor (GPCR)
Mol. Mass.:42648.76
Organism:Homo sapiens (Human)
Description:P41145
Residue:380
BDBM50240967
NameBDBM50240967
Synonyms:CHEMBL4090181
TypeSmall organic molecule
Emp. Form.C21H27ClFNO
Mol. Mass.363.897
SMILESCl.Oc1cccc(CCN(CCc2ccccc2)CC2CCC2)c1F