Reaction Details
TargetPhosphatidylinositol 4-kinase beta
LigandBDBM50240975
Substrate/Competitorn/a
Meas. Tech.ChEMBL_1669398 (CHEMBL4019286)
Kd 40000±n/a nM
Citation Beaufils, FCmiljanovic, NCmiljanovic, VBohnacker, TMelone, AMarone, RJackson, EZhang, XSele, ABorsari, CMestan, JHebeisen, PHillmann, PGiese, BZvelebil, MFabbro, DWilliams, RLRageot, DWymann, MP 5-(4,6-Dimorpholino-1,3,5-triazin-2-yl)-4-(trifluoromethyl)pyridin-2-amine (PQR309), a Potent, Brain-Penetrant, Orally Bioavailable, Pan-Class I PI3K/mTOR Inhibitor as Clinical Candidate in Oncology. J Med Chem60:7524-7538 (2017) 
 
Phosphatidylinositol 4-kinase beta
Name:Phosphatidylinositol 4-kinase beta
Type:Protein
Mol. Mass.:91373.30
Organism:Homo sapiens (Human)
Description:n/a
Residue:816
BDBM50240975
NameBDBM50240975
Synonyms:CHEMBL4084907
TypeSmall organic molecule
Emp. Form.C17H20F3N7O2
Mol. Mass.411.3816
SMILESNc1cc(c(cn1)-c1nc(nc(n1)N1CCOCC1)N1CCOCC1)C(F)(F)F