Reaction Details
TargetSerine/threonine-protein kinase mTOR
LigandBDBM50240988
Substrate/Competitorn/a
Meas. Tech.ChEMBL_1669411 (CHEMBL4019299)
IC50 1100000±n/a nM
Citation Beaufils, FCmiljanovic, NCmiljanovic, VBohnacker, TMelone, AMarone, RJackson, EZhang, XSele, ABorsari, CMestan, JHebeisen, PHillmann, PGiese, BZvelebil, MFabbro, DWilliams, RLRageot, DWymann, MP 5-(4,6-Dimorpholino-1,3,5-triazin-2-yl)-4-(trifluoromethyl)pyridin-2-amine (PQR309), a Potent, Brain-Penetrant, Orally Bioavailable, Pan-Class I PI3K/mTOR Inhibitor as Clinical Candidate in Oncology. J Med Chem60:7524-7538 (2017) 
 
Serine/threonine-protein kinase mTOR
Name:Serine/threonine-protein kinase mTOR
Type:Rapamycin target protein
Mol. Mass.:288917.12
Organism:Homo sapiens (Human)
Description:P42345
Residue:2549
BDBM50240988
NameBDBM50240988
Synonyms:CHEMBL4100862
TypeSmall organic molecule
Emp. Form.C17H18ClF3N6O2
Mol. Mass.430.812
SMILESFC(F)(F)c1cc(Cl)ncc1-c1nc(nc(n1)N1CCOCC1)N1CCOCC1