Reaction Details
TargetMitogen-activated protein kinase 14
LigandBDBM50241015
Substrate/Competitorn/a
Meas. Tech.ChEMBL_1669514 (CHEMBL4019402)
IC50 0.800000±n/a nM
Citation Walter, NMWentsch, HKBührmann, MBauer, SMDöring, EMayer-Wrangowski, SSievers-Engler, AWillemsen-Seegers, NZaman, GBuijsman, RLämmerhofer, MRauh, DLaufer, SA Design, Synthesis, and Biological Evaluation of Novel Type I J Med Chem60:8027-8054 (2017) 
 
Mitogen-activated protein kinase 14
Name:Mitogen-activated protein kinase 14
Type:Serine/threonine-protein kinase
Mol. Mass.:41286.76
Organism:Homo sapiens (Human)
Description:Q16539
Residue:360
BDBM50241015
NameBDBM50241015
Synonyms:CHEMBL4093914
TypeSmall organic molecule
Emp. Form.C32H28FN3O5
Mol. Mass.553.5802
SMILESOCC(O)CNC(=O)c1ccc2CCc3cc(Nc4ccc(F)c(NC(=O)c5ccccc5)c4)ccc3C(=O)c2c1