Reaction Details
TargetMitogen-activated protein kinase 14
LigandBDBM50241036
Substrate/Competitorn/a
Meas. Tech.ChEMBL_1669514 (CHEMBL4019402)
IC50 1.1±n/a nM
Citation Walter, NMWentsch, HKBührmann, MBauer, SMDöring, EMayer-Wrangowski, SSievers-Engler, AWillemsen-Seegers, NZaman, GBuijsman, RLämmerhofer, MRauh, DLaufer, SA Design, Synthesis, and Biological Evaluation of Novel Type I J Med Chem60:8027-8054 (2017) 
 
Mitogen-activated protein kinase 14
Name:Mitogen-activated protein kinase 14
Type:Serine/threonine-protein kinase
Mol. Mass.:41286.76
Organism:Homo sapiens (Human)
Description:Q16539
Residue:360
BDBM50241036
NameBDBM50241036
Synonyms:CHEMBL4083921
TypeSmall organic molecule
Emp. Form.C28H20F2N2O4S
Mol. Mass.518.531
SMILESCOC(=O)c1ccc2CCc3cc(Nc4cc(NC(=O)c5cccs5)c(F)cc4F)ccc3C(=O)c2c1