Reaction Details
TargetMitogen-activated protein kinase 14
LigandBDBM50241010
Substrate/Competitorn/a
Meas. Tech.ChEMBL_1669516 (CHEMBL4019404)
IC50 0.280000±n/a nM
Citation Walter, NMWentsch, HKBührmann, MBauer, SMDöring, EMayer-Wrangowski, SSievers-Engler, AWillemsen-Seegers, NZaman, GBuijsman, RLämmerhofer, MRauh, DLaufer, SA Design, Synthesis, and Biological Evaluation of Novel Type I J Med Chem60:8027-8054 (2017) 
 
Mitogen-activated protein kinase 14
Name:Mitogen-activated protein kinase 14
Type:Serine/threonine-protein kinase
Mol. Mass.:41286.76
Organism:Homo sapiens (Human)
Description:Q16539
Residue:360
BDBM50241010
NameBDBM50241010
Synonyms:CHEMBL4074237
TypeSmall organic molecule
Emp. Form.C33H30FN3O5
Mol. Mass.567.6068
SMILESCc1cc(F)c(NC(=O)c2ccccc2)cc1Nc1ccc2c(CCc3ccc(cc3C2=O)C(=O)NC[C@@H](O)CO)c1