Reaction Details
TargetMitogen-activated protein kinase 14
LigandBDBM50241077
Substrate/Competitorn/a
Meas. Tech.ChEMBL_1669514 (CHEMBL4019402)
IC50 0.100000±n/a nM
Citation Walter, NMWentsch, HKBührmann, MBauer, SMDöring, EMayer-Wrangowski, SSievers-Engler, AWillemsen-Seegers, NZaman, GBuijsman, RLämmerhofer, MRauh, DLaufer, SA Design, Synthesis, and Biological Evaluation of Novel Type I J Med Chem60:8027-8054 (2017) 
 
Mitogen-activated protein kinase 14
Name:Mitogen-activated protein kinase 14
Type:Serine/threonine-protein kinase
Mol. Mass.:41286.76
Organism:Homo sapiens (Human)
Description:Q16539
Residue:360
BDBM50241077
NameBDBM50241077
Synonyms:CHEMBL4060815
TypeSmall organic molecule
Emp. Form.C30H22F3N3O3
Mol. Mass.529.5092
SMILESCNC(=O)c1ccc2CCc3cc(Nc4cc(NC(=O)c5cccc(F)c5)c(F)cc4F)ccc3C(=O)c2c1