Reaction Details
TargetBifunctional epoxide hydrolase 2
LigandBDBM50241116
Substrate/Competitorn/a
Meas. Tech.ChEMBL_1669528 (CHEMBL4019416)
IC50 4.1±n/a nM
Citation Schmidt, JRotter, MWeiser, TWittmann, SWeizel, LKaiser, AHeering, JGoebel, TAngioni, CWurglics, MPaulke, AGeisslinger, GKahnt, ASteinhilber, DProschak, EMerk, D A Dual Modulator of Farnesoid X Receptor and Soluble Epoxide Hydrolase To Counter Nonalcoholic Steatohepatitis. J Med Chem60:7703-7724 (2017) 
 
Bifunctional epoxide hydrolase 2
Name:Bifunctional epoxide hydrolase 2
Type:Enzyme
Mol. Mass.:62613.07
Organism:Homo sapiens (Human)
Description:P34913
Residue:555
BDBM50241116
NameBDBM50241116
Synonyms:CHEMBL4066332
TypeSmall organic molecule
Emp. Form.C19H23ClN2O3S
Mol. Mass.394.916
SMILESCC(C)(C)c1ccc(cc1)C(=O)NCc1ccc(NS(C)(=O)=O)cc1Cl