Reaction Details
TargetProtein-glutamine gamma-glutamyltransferase 2
LigandBDBM50241214
Substrate/Competitorn/a
Meas. Tech.ChEMBL_1669702 (CHEMBL4019590)
Ki 35100±n/a nM
Citation Akbar, AMcNeil, NMRAlbert, MRTa, VAdhikary, GBourgeois, KEckert, RLKeillor, JW Structure-Activity Relationships of Potent, Targeted Covalent Inhibitors That Abolish Both the Transamidation and GTP Binding Activities of Human Tissue Transglutaminase. J Med Chem60:7910-7927 (2017) 
 
Protein-glutamine gamma-glutamyltransferase 2
Name:Protein-glutamine gamma-glutamyltransferase 2
Type:Protein
Mol. Mass.:77309.30
Organism:Homo sapiens (Human)
Description:P21980
Residue:687
BDBM50241214
NameBDBM50241214
Synonyms:CHEMBL4094701
TypeSmall organic molecule
Emp. Form.C17H23N3O4
Mol. Mass.333.3822
SMILESNC(=O)[C@H](CCCCNC(=O)C=C)NC(=O)OCc1ccccc1